{"text_format":"1","workbook":"xlsx","n_sheets":8,"sheets":["notes","Pro Forma","Revenue Basis","Biennum for formula funding","THECB tables","Acad Prog Bus Plan Instruction","Instruction Formula Weights","Tuition Groups Table"],"not_rendered":{"charts":0,"images":1,"macros":1,"external_links":2,"defined_names":158,"comments":0,"pivot_tables":0},"unopened":[],"bounds":{"document_bytes":16777216,"sheet_cells":100000,"rows_first":2000,"rows_last":500,"rows_between":2000,"halvings":0,"cell_chars":16384,"cell_head_chars":4096},"cells_cut":0,"cells_raw":0,"read":"whole","date_system":"1900"}

{"sheet":"notes","index":0,"n_rows":44,"n_cols":4,"rows_kept":44,"cut":false,"hidden":true,"merged":[]}
["Current Date","2025-08-29"]
[]
["version","Date Created","Notes","Created by"]
[1,"2025-08-29","Change allolcated set a side formula","Viv"]
[2,"2025-08-29","Change allolcated set a side formula","Viv"]
[null,"2025-08-29","Undergraduate Allocated set a side 97% per Madiha Syeda 8/20/25","Viv"]
[null,"2025-08-29","Graduate Allocated set a side 85% per  per Madiha Syeda 8/20/25","Viv"]
[null,"2025-08-29","update Tuition groups to FY26 table from Gretta McClain Gibbs","Viv"]
[null,"2025-08-29","update UG and GRAD set a side","Viv"]
[]
[]
[]
[]
[]
[]
[]
[]
[]
[]
["This pro-forma is use to calculate new program profit loss in a 5 years period"]
{"$rows_left_out":25}
{"sheet":"Pro Forma","index":1,"n_rows":91,"n_cols":12,"rows_kept":91,"cut":false,"hidden":false,"merged":[[2,5,2,9]]}
["PRO FORMA FOR BS in "]
[]
[null,null,null,null,null,"Operating Years"]
[null,14,null,null,"Year 0",{"$f":"VLOOKUP($B$4,'Biennum for formula funding'!$A$2:$H$24,2,FALSE)","v":"FY2027"},{"$f":"VLOOKUP($B$4+1,'Biennum for formula funding'!$A$2:$H$24,2,FALSE)","v":"FY2028"},{"$f":"VLOOKUP($B$4+2,'Biennum for formula funding'!$A$2:$H$24,2,FALSE)","v":"FY2029"},{"$f":"VLOOKUP($B$4+3,'Biennum for formula funding'!$A$2:$H$24,2,FALSE)","v":"FY2030"},{"$f":"VLOOKUP($B$4+4,'Biennum for formula funding'!$A$2:$H$24,2,FALSE)","v":"FY2031"}]
["Enrollments",null,null,null,null,{"$f":"VLOOKUP($B$4,'Biennum for formula funding'!$A$2:$H$24,3,FALSE)","v":"Fall26"},{"$f":"VLOOKUP($B$4+1,'Biennum for formula funding'!$A$2:$H$24,3,FALSE)","v":"Fall27"},{"$f":"VLOOKUP($B$4+2,'Biennum for formula funding'!$A$2:$H$24,3,FALSE)","v":"Fall28"},{"$f":"VLOOKUP($B$4+3,'Biennum for formula funding'!$A$2:$H$24,3,FALSE)","v":"Fall29"},{"$f":"VLOOKUP($B$4+4,'Biennum for formula funding'!$A$2:$H$24,3,FALSE)","v":"Fall30"},"Five year totals"]
[null,"Cohort 1"]
[null,"Cohort 2"]
[null,"Cohort 3"]
[null,"Cohort 4"]
[null,"Cohort 5"]
[null,"Cohort 6"]
[null,"Total",null,null,null,{"$f":"SUM(F6:F11)","v":0},{"$f":"SUM(G6:G11)","v":0},{"$f":"SUM(H6:H11)","v":0},{"$f":"SUM(I6:I11)","v":0},{"$f":"SUM(J6:J11)","v":0},{"$f":"SUM(F12:J12)","v":0}]
[]
["Expenses"]
["Faculty (9 month)",null,"Salary"," % effort","Year 0",{"$f":"VLOOKUP($B$4,'Biennum for formula funding'!$A$2:$H$24,2,FALSE)","v":"FY2027"},{"$f":"VLOOKUP($B$4+1,'Biennum for formula funding'!$A$2:$H$24,2,FALSE)","v":"FY2028"},{"$f":"VLOOKUP($B$4+2,'Biennum for formula funding'!$A$2:$H$24,2,FALSE)","v":"FY2029"},{"$f":"VLOOKUP($B$4+3,'Biennum for formula funding'!$A$2:$H$24,2,FALSE)","v":"FY2030"},{"$f":"VLOOKUP($B$4+4,'Biennum for formula funding'!$A$2:$H$24,2,FALSE)","v":"FY2031"}]
[null,"Position 1",null,null,null,{"$f":"D16*C16","v":0},{"$f":"F16*1.02","v":0},{"$f":"G16*1.02","v":0},{"$f":"H16*1.02","v":0},{"$f":"I16*1.02","v":0}]
[null,"Position 2",null,null,null,{"$f":"D17*C17","v":0},{"$f":"F17*1.02","v":0},0,0,0]
[null,"Position 3",null,null,null,0,0,0,0,0]
[null,"Position 4",null,null,null,0,0,0,0,0]
[null,"Position 5",null,null,null,0,0,0,0,0]
{"$rows_left_out":72}
{"sheet":"Revenue Basis","index":2,"n_rows":42,"n_cols":12,"rows_kept":42,"cut":false,"hidden":false,"merged":[]}
[{"$f":"'Pro Forma'!A1","v":"PRO FORMA FOR BS in "}]
[]
["Revenue by Source"]
[]
["Assumptions"]
[null,"Resident Tuition used as basis for projections."]
[null,"College and Career Path (select from the drop down box in cell C7)",57]
[null,"Label from Instruction and Operation Formula Tab (select the drop down box in cell C8)",51]
[null,"Instructional and Operations Formula weighting",{"$f":"INDEX('Instruction Formula Weights'!A2:B72,C8,2)","v":1.34}]
[null,"Formula rate per weighted SCH for 2026-27 biennium",60.67]
[null,"SCH fall Semester"]
[null,"SCH spring semester"]
[null,"SCH summer semester"]
[null,"Hours per course"]
[null,"Allocated to set aside per SCH",{"$f":"INDEX('Tuition Groups Table'!E4:S81,C7,15)","v":39.628700000000002}]
[]
["Proposed Consolidated Tuition & Fees",null,"Rate","Fall","Spring","Summer","Annual Total"]
[null,{"$f":"INDEX('Tuition Groups Table'!E4:G81,C7,2)","v":"COA 1 - Prof Grad"},{"$f":"INDEX('Tuition Groups Table'!E4:S81,C7,11)","v":421.76},{"$f":"Graduate_CTF*SCH_fall_Semester","v":0},{"$f":"Graduate_CTF*SCH_spring_semester","v":0},{"$f":"Graduate_CTF*SCH_summer_semester","v":0},{"$f":"SUM(D18:F18)","v":0}]
[null,"Certificate & Executive Fee",null,{"$f":"Certificate___Executive_Fee*SCH_fall_Semester","v":0},{"$f":"Certificate___Executive_Fee*SCH_spring_semester","v":0},{"$f":"Certificate___Executive_Fee*SCH_summer_semester","v":0},{"$f":"SUM(D19:F19)","v":0}]
[null,"Tuition & Fees for Academic Semester",null,{"$f":"SUM(D18:D19)","v":0},{"$f":"SUM(E18:E19)","v":0},{"$f":"SUM(F18:F19)","v":0},{"$f":"SUM(G18:G19)","v":0}]
{"$rows_left_out":23}
{"sheet":"Biennum for formula funding","index":3,"n_rows":83,"n_cols":19,"rows_kept":83,"cut":false,"hidden":true,"merged":[]}
[null,"Fiscal year","Fall","Spring","Summer","Biennium Fall","Biennium Spring","Biennium Summer","Semester listing","Biennum Period","Funding Years","Biennum for Fiscal Year"]
[1,"FY2014","Fall13","Spr14","Sum14",0,0,1,"Fall13, Spr14, Sum14","2016-17 Biennum","FY2016","2014-15 Biennum",{"$f":"VLOOKUP('Biennum for formula funding'!J2,'Revenue Basis'!$H$35:$I$42,2,FALSE)","v":{"$error":"#N/A"}},null,null,null,null,null,"2020-21 Biennum"]
[2,"FY2015","Fall14","Spr15","Sum15",1,1,0,"Fall14, Spr15, Sum15","2016-17 Biennum","FY2017","2014-15 Biennum",{"$f":"VLOOKUP('Biennum for formula funding'!J3,'Revenue Basis'!$H$35:$I$42,2,FALSE)","v":{"$error":"#N/A"}},null,null,null,null,null,"2022-23 Biennum"]
[3,"FY2016","Fall15","Spr16","Sum16",0,0,1,"Fall15, Spr16, Sum16","2018-19 Biennum","FY2018","2016-17 Biennum",{"$f":"VLOOKUP('Biennum for formula funding'!J4,'Revenue Basis'!$H$35:$I$42,2,FALSE)","v":{"$error":"#N/A"}},null,null,null,null,null,"2024-25 Biennum"]
[4,"FY2017","Fall16","Spr17","Sum17",1,1,0,"Fall16, Spr17, Sum17","2018-19 Biennum","FY2019","2016-17 Biennum",{"$f":"VLOOKUP('Biennum for formula funding'!J5,'Revenue Basis'!$H$35:$I$42,2,FALSE)","v":{"$error":"#N/A"}},null,null,null,null,null,"2026-27 Biennum"]
[5,"FY2018","Fall17","Spr18","Sum18",0,0,1,"Fall17, Spr18, Sum18","2020-21 Biennum","FY2020","2018-19 Biennum",{"$f":"VLOOKUP('Biennum for formula funding'!J6,'Revenue Basis'!$H$35:$I$42,2,FALSE)","v":{"$error":"#N/A"}},null,null,null,null,null,"2028-29 Biennum"]
[6,"FY2019","Fall18","Spr19","Sum19",1,1,0,"Fall18, Spr19, Sum19","2020-21 Biennum","FY2021","2018-19 Biennum",{"$f":"VLOOKUP('Biennum for formula funding'!J7,'Revenue Basis'!$H$35:$I$42,2,FALSE)","v":{"$error":"#N/A"}},null,null,null,null,null,"2030-31 Biennum"]
[7,"FY2020","Fall19","Spr20","Sum20",0,0,1,"Fall19, Spr20, Sum20","2022-23 Biennum","FY2022","2020-21 Biennum",{"$f":"VLOOKUP('Biennum for formula funding'!J8,'Revenue Basis'!$H$35:$I$42,2,FALSE)","v":{"$error":"#N/A"}},null,null,null,null,null,"2032-33 Biennum"]
[8,"FY2021","Fall20","Spr21","Sum21",1,1,0,"Fall20, Spr21, Sum21","2022-23 Biennum","FY2023","2020-21 Biennum",{"$f":"VLOOKUP('Biennum for formula funding'!J9,'Revenue Basis'!$H$35:$I$42,2,FALSE)","v":{"$error":"#N/A"}},null,null,null,null,null,"2034-35 Biennum"]
[9,"FY2022","Fall21","Spr22","Sum22",0,0,1,"Fall21, Spr22, Sum22","2024-25 Biennum","FY2024","2022-23 Biennum",{"$f":"VLOOKUP('Biennum for formula funding'!J10,'Revenue Basis'!$H$35:$I$42,2,FALSE)","v":{"$error":"#N/A"}},null,null,null,null,null,"2036-37 Biennum"]
[10,"FY2023","Fall22","Spr23","Sum23",1,1,0,"Fall22, Spr23, Sum23","2024-25 Biennum","FY2025","2022-23 Biennum",{"$f":"VLOOKUP('Biennum for formula funding'!J11,'Revenue Basis'!$H$35:$I$42,2,FALSE)","v":{"$error":"#N/A"}}]
[11,"FY2024","Fall23","Spr24","Sum24",0,0,1,"Fall23, Spr24, Sum24","2026-27 Biennum","FY2026","2024-25 Biennum",{"$f":"VLOOKUP('Biennum for formula funding'!J12,'Revenue Basis'!$H$35:$I$42,2,FALSE)","v":{"$error":"#N/A"}}]
[12,"FY2025","Fall24","Spr25","Sum25",1,1,0,"Fall24, Spr25, Sum25","2026-27 Biennum","FY2027","2024-25 Biennum",{"$f":"VLOOKUP('Biennum for formula funding'!J13,'Revenue Basis'!$H$35:$I$42,2,FALSE)","v":{"$error":"#N/A"}}]
[13,"FY2026","Fall25","Spr26","Sum26",0,0,1,"Fall25, Spr26, Sum26","2028-29 Biennum","FY2028","2026-27 Biennum",{"$f":"VLOOKUP('Biennum for formula funding'!J14,'Revenue Basis'!$H$35:$I$42,2,FALSE)","v":0}]
[14,"FY2027","Fall26","Spr27","Sum27",1,1,0,"Fall26, Spr27, Sum27","2028-29 Biennum","FY2029","2026-27 Biennum",{"$f":"VLOOKUP('Biennum for formula funding'!J15,'Revenue Basis'!$H$35:$I$42,2,FALSE)","v":0}]
[15,"FY2028","Fall27","Spr28","Sum28",0,0,1,"Fall27, Spr28, Sum28","2030-31 Biennum","FY2030","2028-29 Biennum",{"$f":"VLOOKUP('Biennum for formula funding'!J16,'Revenue Basis'!$H$35:$I$42,2,FALSE)","v":0}]
[16,"FY2029","Fall28","Spr29","Sum29",1,1,0,"Fall28, Spr29, Sum29","2030-31 Biennum","FY2031","2028-29 Biennum",{"$f":"VLOOKUP('Biennum for formula funding'!J17,'Revenue Basis'!$H$35:$I$42,2,FALSE)","v":0}]
[17,"FY2030","Fall29","Spr30","Sum30",0,0,1,"Fall29, Spr30, Sum30","2032-33 Biennum","FY2032","2030-31 Biennum",{"$f":"VLOOKUP('Biennum for formula funding'!J18,'Revenue Basis'!$H$35:$I$42,2,FALSE)","v":0}]
[18,"FY2031","Fall30","Spr31","Sum31",1,1,0,"Fall30, Spr31, Sum31","2032-33 Biennum","FY2033","2030-31 Biennum",{"$f":"VLOOKUP('Biennum for formula funding'!J19,'Revenue Basis'!$H$35:$I$42,2,FALSE)","v":0}]
[19,"FY2032","Fall31","Spr32","Sum32",0,0,1,"Fall31, Spr32, Sum32","2034-35 Biennum","FY2034","2032-33 Biennum",{"$f":"VLOOKUP('Biennum for formula funding'!J20,'Revenue Basis'!$H$35:$I$42,2,FALSE)","v":0}]
{"$rows_left_out":64}
{"sheet":"THECB tables","index":4,"n_rows":84,"n_cols":11,"rows_kept":84,"cut":false,"hidden":false,"merged":[[59,1,59,6],[60,1,60,6],[10,1,10,2],[24,1,25,10],[28,1,28,6],[47,1,47,6],[56,1,57,10],[1,1,2,10],[4,1,4,4],[7,1,7,2],[8,1,8,2],[8,4,8,10]]}
["THECB tables"]
[null,"DRAFT"]
[]
[]
[null,"THECB recognizes that additional costs such as housing, childcare, etc., are needed for many students. However, because these costs are highly variable by student, they are not included in the costs and funding tables."]
[]
["Enrollment, Costs, and Support"]
[null,"Table xx: Estimated Annual Required Per Student Costs",null,null,"Table xx:  Estimated Average Total Student Funding"]
[null,"Please provide the estimated average annual required per student costs for students in the degree program. Averages from similar programs or disciplines, or even institutional averages, may be used if no other information is available. ",null,null,"Please provide the estimated average annual total student funding available to students in the degree program."]
[null," Cost Type","Dollar Amount",null,"Funding Type"," Year 1 ","Year 2 ","Year 3 ","Year 4 ","Year 5 ","5-Year Total"]
[null,"Per Student Annual Costs",null,null,"Scholarships ",null,null,null,null,null,{"$f":"SUM(F11:J11)","v":0}]
[null,"Resident Tuition",null,null,"Teaching Assistantships ",null,null,null,null,null,{"$f":"SUM(F12:J12)","v":0}]
[null,"Non-Resident Tuition",null,null,"Research Assistantships","  ",null,null,null,null,{"$f":"SUM(F13:J13)","v":0}]
[null,"Required Fees ",null,null,"Other funding [please specify]",null,null,null,null,null,{"$f":"SUM(F14:J14)","v":0}]
[null,"Health Insurance Fee",null,null,"Total Funding",{"$f":"SUM(F11:F13)","v":0},{"$f":"SUM(G11:G13)","v":0},{"$f":"SUM(H11:H13)","v":0},{"$f":"SUM(I11:I13)","v":0},{"$f":"SUM(J11:J13)","v":0},{"$f":"SUM(K11:K14)","v":0}]
[null,"Course Materials "]
[null,"Other [please specify] "]
[null,"Estimated Time to Degree (in years, assuming full-time enrollment)"]
[]
[null,"Per Student One-Time Required Fees (if applicable) \n[e.g., clinical fieldwork semester fees]"]
{"$rows_left_out":65}
{"sheet":"Acad Prog Bus Plan Instruction","index":5,"n_rows":19,"n_cols":2,"rows_kept":19,"cut":false,"hidden":true,"merged":[]}
["Academic Program Business Plan Template"]
["Pro Forma tab"]
[1,"Whoever is filling out the program will indicate their five starting years on the Pro Forma sheet in row 4 and columns F through J."]
[2,"Indicate the projected number of students for each cohort."]
[3,"Indicate who they will be hiring into each of the faculty positions. You can add more rows to this, but they need to be inserted above line 19 for the formulas to work correctly."]
[4,"Indicate the amount of salary that they will pay the adjuncts."]
[5,"Indicate who they will be hiring into each of the staff positions. You can add more rows to this, but they need to be inserted above line 26 for the formulas to work correctly."]
[6,"Indicate the amount of salary that they will pay the graduate students."]
[7,"Benefits are calculated at 30% for all staff and faculty members."]
[8,"If there are year 0 costs that will be associated with this proposed program, these can be indicated in column E (Year 0)."]
[9,"Fill out their non-personnel costs that will be associated with this program in rows 35 through 42."]
[10,"The Allocated to university Operations is calculated at 48% of Total Revenue from Enrollment (row 53)."]
[11,"If there is university support or other external revenue that will be associated with this program, then this will be indicated on rows 54 and 55."]
["Revenue Basis tab"]
[1,"Select the appropriate College and Career Path from the dropdown box."]
[2,"Select the correct label from the Instruction and Operation Formula dropdown box."]
[3,"Fill out the number of hours that will be taken during the Fall, Spring, and Summer semesters."]
[4,"If there is a Certificate & Executive Fee, then this needs to be put into C19."]
[5,"The SCH by semester will populate once the student headcount has been inputted in the Pro Forma tab."]

{"sheet":"Instruction Formula Weights","index":6,"n_rows":594,"n_cols":16,"rows_kept":594,"cut":false,"hidden":true,"merged":[[521,1,521,4]]}
["Category and level","Instruction Formula Weighting","Bienium",null,null,null,null,"Update:","2025-08-01"]
["Agriculture: Lower Div. ",{"$f":"L3","v":1.35},"2026-2027",null,null,null,null,"by:","Vivianne Do","2025-07-25","Discipline","Undergraduate Lower-Level","Undergraduate Upper-Level","Master's","Doctoral","Professional Practice"]
["Agriculture: Upper Div.",{"$f":"M3","v":2.2400000000000002},"2026-2027",null,null,null,null,null,null,null,"Agriculture",1.35,2.2400000000000002,8.92,15.42,0]
["Agriculture: Masters",{"$f":"N3","v":8.92},"2026-2027",null,null,null,null,null,null,null,"Business Admin",1.1000000000000001,1.88,3,39.01]
["Agriculture: Doctoral",{"$f":"O3","v":15.42},"2026-2027",null,null,null,null,null,null,null,"Developmental Ed",1,0,0,0,0]
["Business Admin: Lower Div. ",{"$f":"L4","v":1.1000000000000001},"2026-2027",null,null,null,null,null,null,null,"Engineering",1.71,2.73,5.44,19.57]
["Business Admin: Upper Div.",{"$f":"M4","v":1.88},"2026-2027",null,null,null,null,null,null,null,"Fine Arts",1.38,2.64,7.54,11.47]
["Business Admin: Masters",{"$f":"N4","v":3},"2026-2027",null,null,null,null,null,null,null,"Health Services",0.94,1.57,2.57,7.69,3.35]
["Business Admin: Doctoral",{"$f":"O4","v":39.01},"2026-2027",null,null,null,null,null,null,null,"Home Economics",0.9,1.78,3.18,15.93,0]
["Business Admin: Special Professional",{"$f":"P4","v":0},"2026-2027",null,null,null,null,null,null,null,"Law",0,0,0,0,5]
["Developmental Ed: Lower Div. ",{"$f":"L5","v":1},"2026-2027",null,null,null,null,null,null,null,"Liberal Arts",1,1.88,4.4000000000000004,14.78,0]
["Engineering: Lower Div. ",{"$f":"L6","v":1.71},"2026-2027",null,null,null,null,null,null,null,"Library Science",1.86,2.5299999999999998,3.29,26.29,0]
["Engineering: Upper Div.",{"$f":"M6","v":2.73},"2026-2027",null,null,null,null,null,null,null,"Nursing",1.56,2.09,2.77,9.91]
["Engineering: Masters",{"$f":"N6","v":5.44},"2026-2027",null,null,null,null,null,null,null,"Optometry",0,0,0,0,6.78]
["Engineering: Doctoral",{"$f":"O6","v":19.57},"2026-2027",null,null,null,null,null,null,null,"Pharmacy",6.74,3.61,34.39,45.27,4.59]
["Fine Arts: Lower Div. ",{"$f":"L7","v":1.38},"2026-2027",null,null,null,null,null,null,null,"Physical Training",2.08,7.66,0,0,0]
["Fine Arts: Upper Div.",{"$f":"M7","v":2.64},"2026-2027",null,null,null,null,null,null,null,"Science",1.34,2.66,5.48,22.04]
["Fine Arts: Masters",{"$f":"N7","v":7.54},"2026-2027",null,null,null,null,null,null,null,"Social Services",1.6,1.9,2.5499999999999998,24.79]
["Fine Arts: Doctoral",{"$f":"O7","v":11.47},"2026-2027",null,null,null,null,null,null,null,"Teacher Ed",1.27,1.95,2.3199999999999998,7.59]
["Health Services: Lower Div. ",{"$f":"L8","v":0.94},"2026-2027",null,null,null,null,null,null,null,"Teacher Ed Practice",1.1200000000000001,2.37]
{"$rows_left_out":575}
{"sheet":"Tuition Groups Table","index":7,"n_rows":81,"n_cols":19,"rows_kept":81,"cut":false,"hidden":true,"merged":[[0,0,0,17]]}
["University of Houston Tuition Groups - FY 2026"]
[]
["Group","College","Career",null,"College and Career ","Career","Rate","Statutory Tuition","Designated Tuition","Graduate/ Premium","Tuition Total","Consolidated University Services Fee","College/ University Incidental Fees","Total Mandatory Fees","Total Tuition and Fees","Non-Res Statutory Tuition","Non-Res Designated Tuition","Total Non-Resident Tuition and Fees","Allocated to set aside per SCH"]
["4YF","UG1 Four Year Fixed - Fall/Spring FTIC","Undergraduate",1,{"$f":"CONCATENATE(B4,\": \",C4)","v":"UG1 Four Year Fixed - Fall/Spring FTIC: Undergraduate"},"Undergraduate","Term",750,3974.8199999999997,null,{"$f":"SUM(H4:J4)","v":4724.82},614.25,278.25,{"$f":"L4+M4","v":892.5},{"$f":"K4+N4","v":5617.32},6075,1953.52,{"$f":"O4+P4+Q4","v":13645.84},{"$f":"(0.2*(I4-46))*0.97","v":762.19107999999994}]
["4YF","UG2 Four Year Fixed - Fall/Spring FTIC","Undergraduate",2,{"$f":"CONCATENATE(B5,\": \",C5)","v":"UG2 Four Year Fixed - Fall/Spring FTIC: Undergraduate"},"Undergraduate","Term",750,4343.2,null,{"$f":"SUM(H5:J5)","v":5093.2},614.25,278.25,{"$f":"L5+M5","v":892.5},5985.7,6075,1971.94,{"$f":"O5+P5+Q5","v":14032.640000000001},{"$f":"(0.2*(I5-46))*0.97","v":833.65679999999998}]
["4YF","UG3 Four Year Fixed - Fall/Spring FTIC","Undergraduate",3,{"$f":"CONCATENATE(B6,\": \",C6)","v":"UG3 Four Year Fixed - Fall/Spring FTIC: Undergraduate"},"Undergraduate","Term",750,4886.28,null,5636.28,614.25,278.25,892.5,{"$f":"K6+N6","v":6528.78},6075,1999.09,{"$f":"O6+P6+Q6","v":14602.869999999999},939.01432]
["4YF","UG4 Four Year Fixed - Fall/Spring FTIC","Undergraduate",4,"UG4 Four Year Fixed - Fall/Spring FTIC: Undergraduate","Undergraduate","Term",750,5883.88,null,6633.88,614.25,278.25,892.5,{"$f":"K7+N7","v":7526.38},6075,2048.9700000000003,{"$f":"O7+P7+Q7","v":15650.350000000002},1132.54872]
["4YF","UG1 Four Year Fixed - Summer FTIC","Undergraduate",5,"UG1 Four Year Fixed - Summer FTIC: Undergraduate","Undergraduate","Term",250,1324.94,null,1574.94,204.75,92.75,297.5,1872.44,2025,651.16999999999996,4548.6099999999997,248.11436]
["4YF","UG2 Four Year Fixed - Summer FTIC","Undergraduate",6,"UG2 Four Year Fixed - Summer FTIC: Undergraduate","Undergraduate","Term",250,1447.73,null,1697.73,204.75,92.75,297.5,1995.23,2025,657.31,4677.54,271.93561999999997]
["4YF","UG3 Four Year Fixed - Summer FTIC","Undergraduate",7,"UG3 Four Year Fixed - Summer FTIC: Undergraduate","Undergraduate","Term",250,1628.76,null,1878.76,204.75,92.75,297.5,2176.2600000000002,2025,666.36,4867.62,307.05544000000003]
["4YF","UG4 Four Year Fixed - Summer FTIC","Undergraduate",8,"UG4 Four Year Fixed - Summer FTIC: Undergraduate","Undergraduate","Term",250,1961.29,null,2211.29,204.75,92.75,297.5,2508.79,2025,682.99,5216.78,371.56626]
["4YF","UG1 Four Year Fixed - Fall/Spring Transfer","Undergraduate",9,"UG1 Four Year Fixed - Fall/Spring Transfer: Undergraduate","Undergraduate","Term",750,4026.88,null,4776.88,614.25,278.25,892.5,5669.38,6075,1956.12,13700.5,772.29072000000008]
["4YF","UG2 Four Year Fixed - Fall/Spring Transfer","Undergraduate",10,"UG2 Four Year Fixed - Fall/Spring Transfer: Undergraduate","Undergraduate","Term",750,4398.68,null,5148.68,614.25,278.25,892.5,6041.18,6075,1974.71,14090.89,844.41992000000005]
["4YF","UG3 Four Year Fixed - Fall/Spring Transfer","Undergraduate",11,"UG3 Four Year Fixed - Fall/Spring Transfer: Undergraduate","Undergraduate","Term",750,4946.82,null,5696.82,614.25,278.25,892.5,6589.32,6075,2002.12,14666.439999999999,950.75907999999993]
["4YF","UG4 Four Year Fixed - Fall/Spring Transfer","Undergraduate",12,"UG4 Four Year Fixed - Fall/Spring Transfer: Undergraduate","Undergraduate","Term",750,5953.69,null,6703.69,614.25,278.25,892.5,7596.19,6075,2052.46,15723.649999999998,1146.09186]
["4YF","UG1 Four Year Fixed - Summer Transfer","Undergraduate",13,"UG1 Four Year Fixed - Summer Transfer: Undergraduate","Undergraduate","Term",250,1342.29,null,1592.29,204.75,92.75,297.5,1889.79,2025,652.04,4566.83,251.48025999999999]
["4YF","UG2 Four Year Fixed - Summer Transfer","Undergraduate",14,"UG2 Four Year Fixed - Summer Transfer: Undergraduate","Undergraduate","Term",250,1466.23,null,1716.23,204.75,92.75,297.5,2013.73,2025,658.24,4696.97,275.52461999999997]
["4YF","UG3 Four Year Fixed - Summer Transfer","Undergraduate",15,"UG3 Four Year Fixed - Summer Transfer: Undergraduate","Undergraduate","Term",250,1648.94,null,1898.94,204.75,92.75,297.5,2196.44,2025,667.37,4888.8100000000004,310.97036000000003]
["4YF","UG4 Four Year Fixed - Summer Transfer","Undergraduate",16,"UG4 Four Year Fixed - Summer Transfer: Undergraduate","Undergraduate","Term",250,1984.56,null,2234.56,204.75,92.75,297.5,2532.06,2025,684.15,5241.2099999999991,376.08063999999996]
["UG1","Education","Undergraduate",17,"Education: Undergraduate","Undergraduate","SCH",50,256.06,0,306.06,40.950000000000003,14.85,55.800000000000004,361.86,405,124.6,891.46,40.751640000000002]
{"$rows_left_out":61}